Qts Numeracy Test

thestudentroom.co.uk - 2013-04-20 20:41:43 - Similar - Report/Block

I just took my first Numeracy test and failed by an epic 5. I am one of the 'c' grade GCSE strugglers but have been studying religiously. I got 20 and 18 on practice test 4 and kept getting a consistent 16 in all the other online practice tests. unfortunately I think I let the 'weight' of passing get to me. The mental maths part went well...

Numeracy test in LCF?

thestudentroom.co.uk - 2013-03-19 10:11:36 - Similar - Report/Block

Can anyone please give me a brief overview of the numeracy test for the London College of Fashion interview? (subjects it covers, difficulty etc?) It's my dream school and I really don't want to screw up my chances by messing up on the maths...

Numeracy Skills Test - A stupid question...

thestudentroom.co.uk - 2013-04-09 19:56:49 - Similar - Report/Block

I have got a place on a Primary PGCE course conditional on me passing the skills tests. I have done some of the online practice papers and managed to pass both, but with the numeracy I was utilising the "guide me" button. My possibly very stupid question is - does the actual test have that facility? I could manage without it, but I want t...

Fault on Skills Test

thestudentroom.co.uk - 2013-03-27 09:28:06 - Similar - Report/Block

Hi, Can anyone help with this or been in a similar position. My daughter is in her third and final year of a teaching degree with QTS. The government changed the rules of skills tests in her final year to just 3 attempts (she couldn't take them before this date). She took her Literacy skills test and passed it first time. She took her Num...

QTS Numeracy Skills Test - Practice Materials?

thestudentroom.co.uk - 2013-02-21 16:09:17 - Similar - Report/Block

Hello I am just wondering if anyone knows of any other practice materials for the QTS Numeracy Skills test - I feel that I am getting too comfortable with the repeat of the questions in the 4 online practice interactive ones, I need some brand new questions that I don't remember the answer to! Many thanks in advance!! Lisa x...

Re-run the failed Selenium Nunit tests

stackoverflow.com - 2012-06-04 09:53:31 - Similar - Report/Block

In our test environment, there are some tests that fail irregularly on certain circumstances. So my question is, what can be done to rerun the failed Nunit tests only. My idea is implement some steps in the Nunit TearDown to re-run the failed test as below [TearDown] public void TearDownTest() TestStatus state = TestContext.Status; if (...

King's College numeracy entrance exam

thestudentroom.co.uk - 2013-05-13 23:37:50 - Similar - Report/Block

I went on their website to look for sample papers and found this year's paper.. this is what it said on the paper: "numeracy screening assessment for entry to BSc and PGDip nursing and midwifery programmes 2013-14" Does that means it's this year's numeracy entrance exam? I have a selection day coming up, are they going to be using that pa...

Help! been offered conditional offer on pre- test

thestudentroom.co.uk - 2013-06-11 23:33:56 - Similar - Report/Block

has anyone sat the numeracy and literacy GCSE equiv test at CCCU ? I believe it is 2 hrs each ? Any ideas how hard it is and where I can find examples? v worried as maths not my strong point !...

arlyne21 project - repost by ronjosephaguilar

freelancer.com - 2013-05-14 16:21:00 - Similar - Report/Block

test test test test test test test test test test test test test test test test test test test test test test test test test test test test test test test test test test test test test test test test test... (Budget: $30-$250 USD, Jobs: Data Entry, Data Processing)...

93 toyota pickup - failed smog in CA

toyotanation.com - 2013-04-10 05:03:25 - Similar - Report/Block

All, I got a 1993 Toyota Pickup, approximately 200K miles. I failed a smog test here in California. Barely passed the 15 MPH test, but failed on the 25 MPH test. The smog guy told me that my CAT is good, but that the truck needs a tune-up. I replaced CAP, ROTOR, and Spark Plugs with Toyota parts. Connecting T and E1 on the data connector,...

Interview with Birmingham City University - Child Nursing

thestudentroom.co.uk - 2013-02-11 15:41:06 - Similar - Report/Block

Hi! I have an interview in a few weeks with Birmingham City for Child Nursing. It says I'll have a numeracy, literacy and IT Test. Is the test hard? I also have one with Swansea Uni, but it says it has no test with the Interview. I have no idea what to expect, any tips? I'm so nervous :(...

Right floated content going under left floated content

stackoverflow.com - 2012-06-15 22:15:27 - Similar - Report/Block


evolveStar Join

Substracting value from the string with regular expression

stackoverflow.com - 2012-02-28 17:19:10 - Similar - Report/Block

There is some log-file. $> cat ./text Tue, 28 Feb 2012 15:43:20 407a3f8bbf704e41bef1f4c0ac24f310 FAILED Tue, 2012 15:45:10 525b13aed6094417a56fd7bc67a10ad7 FAILED Tue, 28 Feb 2012 15:47:08 ae3e2dc3e5b14d0eb7338ab308a32c8e Tue, Feb 2012 15:52:26 18486cbede4e4cb4bee931bf29823dda FAILED Tue, 28 Feb 2012 15:54:17 3c96983a68dd4c5e968dcad512...

iOS tests succeeding, but not running

stackoverflow.com - 2012-04-26 13:39:13 - Similar - Report/Block

I have a couple of SenTestCase subclasses (Logic tests) in by test target, with STFail macros in the test methods. I added the test target through Xcode, when I first created the project (checked "Include Unit Tests"). When I run my tests, I get a spinner saying they are running, and that they succeeded, but they obviously have not run (o...

To take the full CCNA test or ICND1/ICND2?

techexams.net - 2013-06-10 14:36:21 - Similar - Report/Block

I'm having to recertify my expired CCNA , and I was told by someone to take it in two parts. He said he took the full test and failed it, but he then took the two-part test and he considered them to be much easier than the full version. Has anyone else had this experience, or does it really matter? I going to have to borrow the money to t...

CSS Odd/Even td nested

stackoverflow.com - 2011-07-10 20:32:59 - Similar - Report/Block

I am trying to come up with a style my rows with odd/even styles. The row is going to be marked with class odd/even but the style needs to apply to the containing td/th. The reason the style can't be placed directly on the row is because applying background colors to the row instead of the td/th causes inconsistent results in certain brow...

How long does it take to prepare for the DSA theory test?

thestudentroom.co.uk - 2013-04-16 12:46:52 - Similar - Report/Block

Hi, I have recently started getting driving lessons. I have yet to take my theory test, and my instructor now tells me that I should get the theory test out of the way. I did a test online and did the hazard perception on the CD and failed :(. I want to get my theory test out of the way quickly, and now that I have my university assignmen...

Unit testing a static library with RestKit

stackoverflow.com - 2012-07-22 22:09:10 - Similar - Report/Block

I'm attempting to follow along with the RestKit unit test guide ( https://github.com/RestKit/RestKit/wiki/ Unit-Testing-with-RestKit ) except that my project is a static library instead of an app. Here is the test I've written: - (void)testMappingOfDate id parsedJSON = [RKTestFixture parsedObjectWithContentsOfFixture:@"plan .json"]; RKMa...

Debugging unit tests that fail due to a StackOverflow exception

stackoverflow.com - 2013-03-11 11:30:21 - Similar - Report/Block

Whenever a unit test fails due to a StackOverflowException the unit test process immediately exits - the only way to find out what happened (that I am aware of) is to debug a crash dump of the unit test process obtained by following the steps found here Collecting User-Mode Dumps What is the easiest way of getting the name of the unit te...

How can I get Capistrano to stop failing at deploy:create_symlink?

stackoverflow.com - 2012-05-25 22:31:24 - Similar - Report/Block

At least that's where it looks like capistrano is failing. It makes it all the way through the deployment and at the end. here is the output. * executing `deploy:create_symlink' * executing "rm -f ~/xxx.xx.xx/test/current && ln -s ~/xxx.xx.xx/test/releases/20120525193307 ~/xxx.xx.xx/test/current" servers: ["test.xxx.xx.xx"] ["test...

Subject: Images - by: D Deak

getk2.org - 2012-08-30 23:31:03 - Similar - Report/Block

We bought a template from gavick website and the install we fine, but when we try to add an image to a K2 item it seems to go, but it does not add the image. tried to delete the demo images and we get an error as follows Failed deleting ba1b7eb9b8ad142948e3b9dce300b4c6.jpg Failed deleting ba1b7eb9b8ad142948e3b9dce300b4c6_XS.jpg Failed del...

Running junit ant-task without build.xml

stackoverflow.com - 2012-07-11 13:44:21 - Similar - Report/Block

I'm trying to work out how I can run an ant task without actually needed a build.xml. In particular I want to run a JUnit task with a formatter. In xml format this looks like below: <junit printsummary="true" errorProperty="test.failed" failureProperty="test.failed"> <classpath refid="run.class.path" /> <!-- console log...

Selection day - nursing

thestudentroom.co.uk - 2013-02-27 11:59:36 - Similar - Report/Block

I have been invited to a selection day in March for mental health nursing. There will be a literacy and numeracy test and selection event; however, the e-mail was very vague about what would be happening on the day and they did not give much information on the tests. Would anybody be able to offer any information or advice? Thank you!...

GoogleTest Expect call fail for the mock method

stackoverflow.com - 2013-03-20 06:11:46 - Similar - Report/Block

I am new to the GTEST, just understanding the how the Mock works, i tried to write the simple program Foo.h and FooDisplay.h ( which needs the Foo in the constructor), also MockFoo.cpp ( which is the main GTEST program to test the Gmock).. when i mock and do the Expect call for the Foo, it throws below in the execution.. Logs [==========]...

Error in maven (Could not resolve dependencies for project )

java-forums.org - 2013-04-23 16:47:25 - Similar - Report/Block

hi dears I using Spring DM for create web bundle with maven when I compile project with maven , write " BUILD FAILURE " and error is : [INFO] - [INFO] BUILD FAILURE [INFO] - [INFO] Total time: 1:02.367s [INFO] Finished at: Tue Apr 23 07:39:48 PDT 2013 [INFO] Final Memory: 3M/6M [INFO] - [ERROR] Failed to execute goal on project springdm-w...

Why unit testing with Spring 3.1 WebMvcConfig is fail?

stackoverflow.com - 2012-07-03 07:29:56 - Similar - Report/Block

From Spring 3.1, we can use JavaConfig more easily thanks to @Enable* annotations. So I made a WebConfig to set WebMvc configuration, and tried to test it. But if I extends WebMvcConfigurerAdapter or WebMvcConfigurationSupport with WebConfig the unit test fails because of lack of ServletContext. The codes and messages looks like below. W...

poll tag causing conflict

stackoverflow.com - 2013-02-21 08:35:19 - Similar - Report/Block

Below is the xhtml body. I have included this xhtml file in another xhtml named "test.xhtml". My Project consists of 4-5 modules.When i call poll tag in test.xhtml other ajax requests failed to call and shows me the partial response error...

How do I find the path for a failed python import?

stackoverflow.com - 2012-06-01 22:00:56 - Similar - Report/Block

Let's say I have a module which fails to import (there is an exception when importing it). test.py with the following contents: print 1/0 [Obviously, this isn't my actual file, but it will stand in as a good proxy] Now, at the python prompt: >>> import test Traceback (most recent call last): File "<stdin>", line 1, in <...

JUnit - doesn't wait for completion of method under test

stackoverflow.com - 2012-04-20 09:55:11 - Similar - Report/Block

I am using Junit 4.x to test a method. The method under the test is expected to throw an IllegalArgumentException. The method is a blocking method (synchronous) which internally makes a remote ssh connection executes a script and captures result, or throws exception. To test this, I have written my JUnit test code as below. @Test (timeou...

Writing file data into a class? C++

stackoverflow.com - 2013-05-06 00:43:34 - Similar - Report/Block

I have a class that looks like this: class Test public: Test() {} ~Test() {} //I kept these public for simplicity's sake at this point (stead of setters). int first_field; int second_field; int third_field; string name; My .txt file looks like this: 1 2323 88 Test Name A1 2 23432 70 Test Name A2 3 123 67 Test Name B1 4 2332 100 Tes...

Driving test cancelations online

thestudentroom.co.uk - 2013-05-13 11:40:44 - Similar - Report/Block

I failed my driving test the other day and want to rebook as soon as possible. I went online the gov website and clicked change date to try and look at cancellations but it said i had to ring up to do it. Does anyone know why this is? did i click the right thing? Thanks :)...

CSUPLOAD Error: Cannot find the VM Role Agent-Failed the verification tests

stackoverflow.com - 2011-04-08 18:28:59 - Similar - Report/Block

I'm about ready to cry so any help is appreciated: I have prepared a VM Role, installed the Azure Integration Tools and run the sysprep, running csupload from a 64bit command prompt machine, but still am getting this error: Cannot find the VM Role Agent Failed the verification test Cannot prepare VHD..... I tried just bypassing with skipv...

Racket module contract confuse me

stackoverflow.com - 2012-07-22 09:35:55 - Similar - Report/Block

the module: test-define.rkt #lang racket (provide test) (provide (contract-out [add-test! (-> void)])) (define test 0) (define (add-test!) (set! test3 (add1 test))) the main program:act.rkt #lang racket (require "test-define.rkt") (printf "~a~%" (get-test)) (add-test!) (printf "~a~%" (get-test)) run the act.rkt, I get: this is what I...

Google Analytics Regex - Alternative to no negative lookahead

stackoverflow.com - 2012-11-13 13:36:39 - Similar - Report/Block

Google Analytics does not allow negative lookahead anymore within its filters. This is proving to be very difficult to create a custom report only including the links I would like it to include. The regex that includes negative lookahead that would work if it was enabled is: test.com(\/\??index\_(.*)\.php\??(.*)|\/ \?(.*)|\/|)+(\s)*(?!.) T...

Another EtG question! (denatured alcohol)

askmehelpdesk.com - 2013-01-31 07:52:13 - Similar - Report/Block

I'm starting EtG UA's! I refinish wood floors and use numerous gallons of denatured alcohol on a daily basis! To clean and prepare for stain and finish! I know denatured alcohol is basically ethanol and other chemicals! Reading all the different random info on EtG tests I'm definitely worried about a possible failed UA! Many of the other...

Wanstead Test Centre

thestudentroom.co.uk - 2013-05-27 11:11:45 - Similar - Report/Block

So anyone who has taken their test there, which roundabouts did you get in your test? I've not taken a test there yet but in my lessons I do pass a 2 exit one by the shopping area, have no idea if that would be in the test. Also does the Whipps Cross one come in? Then the one that lets you go to Wanstead/Manor Park/Leytonstone. Then there...

End of Year Exams

thebotnet.com - 2013-05-04 07:10:16 - Similar - Report/Block

I'm so skewed for the stats test. I'm in so much treble for my music theory test. I can't evolve my brain to do well on the biology test. I'm really reactive towards the chemistry test. I beta study for that math test. What tests do you have? You don't necessarily have to make a pun for all of them.

Splitting Log Into Individual Files

techguy.org - 2013-02-15 13:39:53 - Similar - Report/Block

I'm stuck with a script again and would appreciate it if anyone can help point me in the right direction. I have a long rolling log which I want to split up into individual files. The following is indicative of the start of entries where each starts on a new line followed by an unpredictable number of lines of text: F:\Test\0001_01.txt F:...

заданные шаблоны

cyberforum.ru - 2012-07-31 13:54:22 - Similar - Report/Block

как сделать выражение чтобы оно отслеживало вот такие шаблоны на такие типы давало положительный результат [TEST] [test] {test} [TEST34] {TEST} , [test] {test} ? [TEST] [test] {test} [TEST56] {TEST} , [test] {test} . [TEST] [test] {test} [TEST67] {TEST} , [test] {test} ! а вот к примеру такие браковало [TEST] [test45] test [TEST]78 {TEST}...

Left Join auf die eigene Tabelle = Rekursiv für Spalten?

entwickler-forum.de - 2013-02-16 13:09:06 - Similar - Report/Block

Hallo Wenn ich die Tabelle A habe mit: ID;Name;Mother_ID 1;test;NULL 2;In-test;1 3;In-test 2;1 4;In-In-Test;2 5;In-In-In-Test;4 Wäre ein Left Join von Mother_ID auf ID eine rekursive Abfrage? Ich möchte als Beispiel alle Einträge des Root (=mother) und deren Child Einträge: Select Name from A Left Join A as a1 ON A.ID = A1.Mother_ID Jedoc...


Fill out the form you see below. Registration is free, fast and simple.
If you are already registered, sign in page login.

Web Site :
Required Field
First Name :
Required Field
Last Name :
Required Field
Email :
Required Field
Sex :
Required Field

evolveStar.com is free for ever !

evolveStar.com provides a search engine that allows you to gather information to write their own blog.

evolveStar.com enhances the sources displaying the logo of the site.

If you want to remove your site or you believe a site listed infringes copyright, please report it to: info@evolvestar.com

Specifies the subject copyright violation and the url of the page

evolveStar.com respecting the law DMCA (Digital Millennium Copyright Act) will immediately remove whatever its merits.

Next will be effectual and relevant checks.

Who We Are Partner Advertising Contacts Privacy terms Help & FAQ

© Copyright 2010-2017 Fabrizio Fichera. All rights reserved.